{"text_format":"1","workbook":"xlsx","n_sheets":8,"sheets":["Deckblatt","Turnierprotokoll","Einzelwertung","Kategoriewertung","Mannschaften","Startliste","Konstanten","players"],"not_rendered":{"charts":0,"images":1,"macros":1,"external_links":0,"defined_names":26,"comments":0,"pivot_tables":0},"unopened":[],"bounds":{"document_bytes":16777216,"sheet_cells":100000,"rows_first":2000,"rows_last":500,"rows_between":2000,"halvings":0,"cell_chars":16384,"cell_head_chars":4096},"cells_cut":0,"cells_raw":0,"read":"whole","date_system":"1900"}

{"sheet":"Deckblatt","index":0,"n_rows":52,"n_cols":16,"rows_kept":52,"cut":false,"hidden":false,"merged":[[7,15,7,17],[50,0,50,3],[38,2,38,4],[38,5,38,10],[39,2,39,4],[39,5,39,10],[40,2,40,4],[40,5,40,10],[37,2,37,4],[37,5,37,10],[41,2,41,4],[41,5,41,10],[47,0,47,3],[34,2,34,4],[34,5,34,10],[35,2,35,4],[35,5,35,10],[36,2,36,4],[36,5,36,10],[31,5,31,10],[32,2,32,4],[32,5,32,10],[33,2,33,4],[33,5,33,10],[9,3,9,5],[9,6,9,9],[9,12,9,13],[12,0,12,13],[13,0,13,13],[9,10,9,11],[7,3,7,5],[7,6,7,9],[7,12,7,13],[8,3,8,5],[8,6,8,9],[8,12,8,13],[7,10,7,11],[8,10,8,11],[0,0,0,13],[1,0,1,13],[2,0,2,13],[3,0,3,13],[5,3,5,5],[5,6,5,9],[5,12,5,13],[5,10,5,11],[4,10,4,11],[4,12,4,13],[32,0,32,1],[33,0,33,1],[34,0,34,1],[35,0,35,1],[36,0,36,1],[37,0,37,1],[38,0,38,1],[39,0,39,1],[40,0,40,1],[41,0,41,1]]}
[{"$f":"IF(Ligawahl<10,\"Minigolfsport-Verband Bremen/Niedersachsen e.V.\",\"Deutscher Minigolfsport Verband e. V.\")","v":"Minigolfsport-Verband Bremen/Niedersachsen e.V."}]
["Ergebnisliste"]
[{"$f":"Spieltagwahl&\". Spieltag  -  \"&VLOOKUP(Ligawahl,Teamgröße,2,0)&\"  -  Saison 2019\"","v":"1. Spieltag  -  Bezirksklasse Nord  -  Saison 2019"}]
[{"$f":"\"am \"&TEXT(P7,\"TT.MM.JJJJ\")&\" in \"&P8","v":"am 00.01.1900 in "}]
[null,null,null,"Name, Vorname",null,null,"Verein",null,null,null,"Spieler-Nr.",null,"Lizenz-Nr."]
["A. Turnierleitung:",null,null,{"$f":"IF(K6=\"\",\"\",IF(ISERROR(VLOOKUP(K6,Spieler,4,0)),\"Falsche Nummer!\",VLOOKUP(K6,Spieler,4,0)&\", \"&VLOOKUP(K6,Spieler,3,0)))","v":""},null,null,{"$f":"IF(ISERROR(VLOOKUP(K6,Spieler,5,0)),\"\",VLOOKUP(K6,Spieler,5,0))","v":""},null,null,null,null,null,{"$f":"IF(ISERROR(VLOOKUP(K6,Spieler,7,0)),\"\",VLOOKUP(K6,Spieler,7,0))","v":""}]
[null,null,null,null,null,null,null,null,null,null,null,null,null,null,"Datum:"]
["B. Schiedsgericht:",null,"OSR:",{"$f":"IF(K8=\"\",\"\",IF(ISERROR(VLOOKUP(K8,Spieler,4,0)),\"Falsche Nummer!\",VLOOKUP(K8,Spieler,4,0)&\", \"&VLOOKUP(K8,Spieler,3,0)))","v":""},null,null,{"$f":"IF(ISERROR(VLOOKUP(K8,Spieler,5,0)),\"\",VLOOKUP(K8,Spieler,5,0))","v":""},null,null,null,null,null,{"$f":"IF(ISERROR(VLOOKUP(K8,Spieler,7,0)),\"\",VLOOKUP(K8,Spieler,7,0))","v":""},null,"Ort:"]
[null,null,"SR:",{"$f":"IF(K9=\"\",\"\",IF(ISERROR(VLOOKUP(K9,Spieler,4,0)),\"Falsche Nummer!\",VLOOKUP(K9,Spieler,4,0)&\", \"&VLOOKUP(K9,Spieler,3,0)))","v":""},null,null,{"$f":"IF(ISERROR(VLOOKUP(K9,Spieler,5,0)),\"\",VLOOKUP(K9,Spieler,5,0))","v":""},null,null,null,null,null,{"$f":"IF(ISERROR(VLOOKUP(K9,Spieler,7,0)),\"\",VLOOKUP(K9,Spieler,7,0))","v":""},null,"System:","Miniaturgolf"]
[null,null,"SR:",{"$f":"IF(K10=\"\",\"\",IF(ISERROR(VLOOKUP(K10,Spieler,4,0)),\"Falsche Nummer!\",VLOOKUP(K10,Spieler,4,0)&\", \"&VLOOKUP(K10,Spieler,3,0)))","v":""},null,null,{"$f":"IF(ISERROR(VLOOKUP(K10,Spieler,5,0)),\"\",VLOOKUP(K10,Spieler,5,0))","v":""},null,null,null,null,null,{"$f":"IF(ISERROR(VLOOKUP(K10,Spieler,7,0)),\"\",VLOOKUP(K10,Spieler,7,0))","v":""}]
[]
["C. Besondere Vorkommnisse:"]
["keine"]
[]
[]
["D. Mannschaftswertung vor dem Spieltag:",null,null,null,null,null,null,null,null,null,null,null,null,null,5]
[null,null,null,null,null,null,"Ort1","Ort2","Ort3","Ort4","Ort5","Ges.","ø","Punkte",1]
[null,null,null,null,null,"gespielte Runden:"]
[1,null,null,null,null,null,null,null,null,null,null,{"$f":"SUM(G19:K19)","v":0},{"$f":"IF(L19<>0,L19/(SUM($G$18:$K$18)*(AnzSp-2)),0)","v":0}]
[]
["E. Mannschaftswertung des Spieltages:"]
[null,null,null,null,null,null,null,"R1","R2","R3","R4","Ges.","ø","Punkte"]
[1,{"$f":"IF(INDIRECT(\"Mannschaften!Z\"&A23*(AnzSp+4)-AnzSp&\"S\"&COLUMN(),0)=\"\",\"\",INDIRECT(\"Mannschaften!Z\"&A23*(AnzSp+4)-AnzSp&\"S\"&COLUMN(),0))","v":""},null,null,null,null,null,{"$f":"IF(INDIRECT(\"Mannschaften!Z\"&$A23*(AnzSp+4)+2&\"S\"&COLUMN()-1,0)=0,\"\",INDIRECT(\"Mannschaften!Z\"&$A23*(AnzSp+4)+2&\"S\"&COLUMN()-1,0))","v":""},"","","",{"$f":"SUM(H23:K23)","v":0},{"$f":"IF(L23<>0,L23/(COUNT(H23:K23)*(AnzSp-2)),0)","v":0}]
[]
["F. Mannschaftswertung nach dem Spieltag:"]
[null,null,null,null,null,null,{"$f":"G17","v":"Ort1"},{"$f":"H17","v":"Ort2"},{"$f":"I17","v":"Ort3"},{"$f":"J17","v":"Ort4"},{"$f":"K17","v":"Ort5"},"Ges.","ø","Punkte"]
[null,null,null,null,null,"gespielte Runden:",{"$f":"IF(G19<>\"\",G18,IF(AnzahlRd>0,AnzahlRd,\"\"))","v":""},{"$f":"IF(H19<>\"\",H18,IF(G19<>\"\",AnzahlRd,\"\"))","v":""},{"$f":"IF(I19<>\"\",I18,IF(H19<>\"\",AnzahlRd,\"\"))","v":""},{"$f":"IF(J19<>\"\",J18,IF(I19<>\"\",AnzahlRd,\"\"))","v":""},{"$f":"IF(K19<>\"\",K18,IF(J19<>\"\",AnzahlRd,\"\"))","v":""}]
[1,null,null,null,null,null,{"$f":"IF(ISERROR(VLOOKUP($B28,Teams,COLUMN()-1,0)),\"\",IF(AND(VLOOKUP($B28,Teams,COLUMN()-1,0)=\"\",OR(VLOOKUP($B28,Teams,COLUMN()-2,0)<>\"\",F$26=\"\")),VLOOKUP($B28,Teams2,11,0),VLOOKUP($B28,Teams,COLUMN()-1,0)))","v":""},"","","","",{"$f":"SUM(G28:K28)","v":0},{"$f":"IF(L28<>0,L28/(SUM($G$27:$K$27)*(AnzSp-2)),0)","v":0},{"$f":"IF(ISERROR(VLOOKUP(B28,Teams,COLUMN()-1,0)),\"\",VLOOKUP(B28,Teams,13,0)+VLOOKUP(B28,Teams2,13,0))","v":""}]
[]
["G. Beste Durchgänge:"]
["Kategorie",null,"Name",null,null,"Verein",null,null,null,null,null,"Erg."]
[{"$f":"(AnzSp-2)&\"er-Mannschaften\"","v":"3er-Mannschaften"}]
["Damen:"]
["Herren: "]
["Seniorinnen I:"]
["Senioren I:"]
["Seniorinnen II:"]
["Senioren II:"]
["Jugend weiblich:"]
["Jugend männlich:"]
["Schülerinnen:"]
["Schüler:"]
[]
["H. Zeichenerklärungen:",null,null,null,"BR ","Bahnrekord"]
[null,null,null,null,"BRE","Bahnrekord eingestellt"]
[]
[]
["Austragungsort, xx.xx.xxxx"]
["Für die Richtigkeit"]
[]
[{"$f":"IF(D6<>\"\",MID(D6,FIND(\",\",D6)+2,99)&\" \"&LEFT(D6,FIND(\",\",D6)-1),\"\")","v":""}]
["(Turnierleitung)"]

{"sheet":"Turnierprotokoll","index":1,"n_rows":27,"n_cols":7,"rows_kept":27,"cut":false,"hidden":false,"merged":[[18,0,18,2],[18,4,18,6],[1,0,1,6],[3,1,3,6],[4,1,4,6],[5,3,5,6],[6,1,6,6],[9,1,9,4],[11,1,11,4],[12,1,12,4],[13,1,13,4],[16,0,16,2],[16,4,16,6],[20,0,20,2],[20,4,20,6],[22,0,22,6],[24,1,24,5],[26,4,26,6]]}
[]
["Turnierprotokoll"]
[]
["Turnier:",{"$f":"Deckblatt!A3","v":"1. Spieltag  -  Bezirksklasse Nord  -  Saison 2019"}]
["Veranstalter:",{"$f":"Deckblatt!A1","v":"Minigolfsport-Verband Bremen/Niedersachsen e.V."}]
["Datum:",{"$f":"Deckblatt!P7","v":"00:00:00"},"Ort:",{"$f":"Deckblatt!P8","v":0}]
["System(e):",{"$f":"Deckblatt!P9","v":"Miniaturgolf"}]
[]
[null,"Name, Vorname",null,null,null,"Verein","Lizenz-Nr."]
["Turnierleiter:",{"$f":"IF(Deckblatt!D6=0,\"\",Deckblatt!D6)","v":""},null,null,null,{"$f":"IF(Deckblatt!G6=0,\"\",Deckblatt!G6)","v":""},{"$f":"IF(Deckblatt!M6=0,\"\",Deckblatt!M6)","v":""}]
[]
["Oberschiedsrichter:",{"$f":"IF(Deckblatt!D8=0,\"\",Deckblatt!D8)","v":""},null,null,null,{"$f":"IF(Deckblatt!G8=0,\"\",Deckblatt!G8)","v":""},{"$f":"IF(Deckblatt!M8=0,\"\",Deckblatt!M8)","v":""}]
["Schiedsrichter:",{"$f":"IF(Deckblatt!D9=0,\"\",Deckblatt!D9)","v":""},null,null,null,{"$f":"IF(Deckblatt!G9=0,\"\",Deckblatt!G9)","v":""},{"$f":"IF(Deckblatt!M9=0,\"\",Deckblatt!M9)","v":""}]
["Schiedsrichter:",{"$f":"IF(Deckblatt!D10=0,\"\",Deckblatt!D10)","v":""},null,null,null,{"$f":"IF(Deckblatt!G10=0,\"\",Deckblatt!G10)","v":""},{"$f":"IF(Deckblatt!M10=0,\"\",Deckblatt!M10)","v":""}]
[]
["Auswechselungen:",null,null,null,"Strafen:"]
["Entfällt"]
["Besondere Vorkommnisse:",null,null,null,"Besonderheiten, Beschädigungen oder Fehler an den Bahnen:"]
[{"$f":"Deckblatt!A13&\", \"&Deckblatt!A14","v":"keine, "}]
["Ausnahmen für Spieler/innen:",null,null,null,"Ausnahmen DMV-Sportordnung/int. Spielregeln:"]
[]
["Proteste, Entscheidung Jury (bei Bedarf ist ein Extrablatt zu fertigen):"]
[]
[]
["Oberschiedsrichter:"]
[]
["Datum:",null,null,"Turnierleiter:"]

{"sheet":"Einzelwertung","index":2,"n_rows":59,"n_cols":14,"rows_kept":59,"cut":false,"hidden":false,"merged":[]}
[]
["I. Einzelwertung"]
["Pl.","Nachname","Vorname","Verein","Sp.Nr.","Kat.","R1","R2","R3","R4","Ges.","ø","Diff."]
[1,{"$f":"IF(E4=\"\",\"\",IF(ISERROR(VLOOKUP(E4,Spieler,4,0)),\"Falsche Nummer!\",VLOOKUP(E4,Spieler,4,0)))","v":""},{"$f":"IF(ISERROR(VLOOKUP(E4,Spieler,3,0)),\"\",VLOOKUP(E4,Spieler,3,0))","v":""},{"$f":"IF(ISERROR(VLOOKUP(E4,Spieler,5,0)),\"\",VLOOKUP(E4,Spieler,5,0))","v":""},null,{"$f":"IF(ISERROR(VLOOKUP(E4,Spieler,2,0)),\"\",VLOOKUP(E4,Spieler,2,0))","v":""},null,null,null,null,{"$f":"IF(COUNT(G4:J4)>0,SUM(G4:J4),\"\")","v":""},{"$f":"IF(K4<>\"\",K4/COUNT(G4:J4),\"\")","v":""},{"$f":"IF(COUNT(G4:J4)>1,LARGE(G4:J4,1)-SMALL(G4:J4,1),\"\")","v":""},{"$f":"IF(F4<>\"\",VLOOKUP(F4,Kategorieliste,2,0),\"\")","v":""}]
[{"$f":"IF(B5<>\"\",A4+1,\"\")","v":""},{"$f":"IF(E5=\"\",\"\",IF(ISERROR(VLOOKUP(E5,Spieler,4,0)),\"Falsche Nummer!\",VLOOKUP(E5,Spieler,4,0)))","v":""},{"$f":"IF(ISERROR(VLOOKUP(E5,Spieler,3,0)),\"\",VLOOKUP(E5,Spieler,3,0))","v":""},"",null,"",null,null,null,null,{"$f":"IF(COUNT(G5:J5)>0,SUM(G5:J5),\"\")","v":""},{"$f":"IF(K5<>\"\",K5/COUNT(G5:J5),\"\")","v":""},{"$f":"IF(COUNT(G5:J5)>1,LARGE(G5:J5,1)-SMALL(G5:J5,1),\"\")","v":""},{"$f":"IF(F5<>\"\",VLOOKUP(F5,Kategorieliste,2,0),\"\")","v":""}]
[{"$f":"IF(B6<>\"\",A5+1,\"\")","v":""},{"$f":"IF(E6=\"\",\"\",IF(ISERROR(VLOOKUP(E6,Spieler,4,0)),\"Falsche Nummer!\",VLOOKUP(E6,Spieler,4,0)))","v":""},{"$f":"IF(ISERROR(VLOOKUP(E6,Spieler,3,0)),\"\",VLOOKUP(E6,Spieler,3,0))","v":""},"",null,"",null,null,null,null,{"$f":"IF(COUNT(G6:J6)>0,SUM(G6:J6),\"\")","v":""},{"$f":"IF(K6<>\"\",K6/COUNT(G6:J6),\"\")","v":""},{"$f":"IF(COUNT(G6:J6)>1,LARGE(G6:J6,1)-SMALL(G6:J6,1),\"\")","v":""},{"$f":"IF(F6<>\"\",VLOOKUP(F6,Kategorieliste,2,0),\"\")","v":""}]
["","","","",null,"",null,null,null,null,"","","",""]
["","","","",null,"",null,null,null,null,"","","",""]
["","","","",null,"",null,null,null,null,"","","",""]
["","","","",null,"",null,null,null,null,"","","",""]
["","","","",null,"",null,null,null,null,"","","",""]
["","","","",null,"",null,null,null,null,"","","",""]
["","","","",null,"",null,null,null,null,"","","",""]
["","","","",null,"",null,null,null,null,"","","",""]
["","","","",null,"",null,null,null,null,"","","",""]
["","","","",null,"",null,null,null,null,"","","",""]
["","","","",null,"",null,null,null,null,"","","",""]
["","","","",null,"",null,null,null,null,"","","",""]
["","","","",null,"",null,null,null,null,"","","",""]
["","","","",null,"",null,null,null,null,"","","",""]
["","","","",null,"",null,null,null,null,"","","",""]
["","","","",null,"",null,null,null,null,"","","",""]
["","","","",null,"",null,null,null,null,"","","",""]
["","","","",null,"",null,null,null,null,"","","",""]
["","","","",null,"",null,null,null,null,"","","",""]
["","","","",null,"",null,null,null,null,"","","",""]
["","","","",null,"",null,null,null,null,"","","",""]
["","","","",null,"",null,null,null,null,"","","",""]
["","","","",null,"",null,null,null,null,"","","",""]
["","","","",null,"",null,null,null,null,"","","",""]
["","","","",null,"",null,null,null,null,"","","",""]
["","","","",null,"",null,null,null,null,"","","",""]
["","","","",null,"",null,null,null,null,"","","",""]
["","","","",null,"",null,null,null,null,"","","",""]
["","","","",null,"",null,null,null,null,"","","",""]
["","","","",null,"",null,null,null,null,"","","",""]
["","","","",null,"",null,null,null,null,"","","",""]
["","","","",null,"",null,null,null,null,"","","",""]
["","","","",null,"",null,null,null,null,"","","",""]
["","","","",null,"",null,null,null,null,"","","",""]
["","","","",null,"",null,null,null,null,"","","",""]
["","","","",null,"",null,null,null,null,"","","",""]
["","","","",null,"",null,null,null,null,"","","",""]
["","","","",null,"",null,null,null,null,"","","",""]
["","","","",null,"",null,null,null,null,"","","",""]
["","","","",null,"",null,null,null,null,"","","",""]
["","","","",null,"",null,null,null,null,"","","",""]
["","","","",null,"",null,null,null,null,"","","",""]
["","","","",null,"",null,null,null,null,"","","",""]
["","","","",null,"",null,null,null,null,"","","",""]
["","","","",null,"",null,null,null,null,"","","",""]
["","","","",null,"",null,null,null,null,"","","",""]
["","","","",null,"",null,null,null,null,"","","",""]
["","","","",null,"",null,null,null,null,"","","",""]
["","","","",null,"",null,null,null,null,"","","",""]
["","","","",null,"",null,null,null,null,"","","",""]
["","","","",null,"",null,null,null,null,"","","",""]
["","","","",null,"",null,null,null,null,"","","",""]
["","","","",null,"",null,null,null,null,"","","",""]

{"sheet":"Kategoriewertung","index":3,"n_rows":3,"n_cols":13,"rows_kept":3,"cut":false,"hidden":false,"merged":[]}
[]
["I. Einzelwertung nach Kategorien"]
["Pl.","Nachname","Vorname","Verein","Sp.Nr.","Kat.","R1","R2","R3","R4","Ges.","ø","Diff."]

{"sheet":"Mannschaften","index":4,"n_rows":11,"n_cols":16,"rows_kept":11,"cut":false,"hidden":false,"merged":[[10,1,10,4],[3,4,3,5],[3,9,3,10]]}
["J. Mannschaftswertung:"]
[]
[]
[1,null,null,null,null,null,null,null,"Schnitt:",{"$f":"IF(COUNTIF(INDIRECT(\"G\"&ROW()+2&\":J\"&ROW()+AnzSp+1),\">0\")>0,K11/(COUNTIF(INDIRECT(\"G\"&ROW()+2&\":J\"&ROW()+AnzSp+1),\">0\")-COUNTIF(INDIRECT(\"L\"&ROW()+2&\":O\"&ROW()+AnzSp+1),\"X\")),0)","v":0}]
["Nr.:","Nachname","Vorname",null,"Sp.Nr.","Kat.","R1","R2","R3","R4","Wertung",null,null,null,null,"Gesamt"]
[1,{"$f":"IF(E6=\"\",\"\",IF(ISERROR(VLOOKUP(E6,Spieler,4,0)),\"Falsche Nummer!\",VLOOKUP(E6,Spieler,4,0)))","v":""},{"$f":"IF(ISERROR(VLOOKUP(E6,Spieler,3,0)),\"\",VLOOKUP(E6,Spieler,3,0))","v":""},null,null,{"$f":"IF(ISERROR(VLOOKUP(E6,Spieler,2,0)),\"\",VLOOKUP(E6,Spieler,2,0))","v":""},{"$f":"IF(ISERROR(VLOOKUP($E6,Ergebnisse,COLUMN()-4,0)),0,VLOOKUP($E6,Ergebnisse,COLUMN()-4,0))","v":0},0,0,0,{"$f":"IF(L6=\"X\",0,G6)+IF(M6=\"X\",0,H6)+IF(N6=\"X\",0,I6)+IF(O6=\"X\",0,J6)","v":0},{"$f":"IF(G6>0,IF(AND(COUNTIF(INDIRECT(\"Z\"&(ROW()+1-$A6&\"S\"&COLUMN()-5)&\":Z\"&(ROW()+AnzSp-$A6)&\"S\"&COLUMN()-5,0),\">0\")=AnzSp-1,G6=LARGE(INDIRECT(\"Z\"&(ROW()+1-$A6&\"S\"&COLUMN()-5)&\":Z\"&(ROW()+AnzSp-$A6)&\"S\"&COLUMN()-5,0),1),COUNTIF(INDIRECT(\"Z\"&(ROW()+1-$A6&\"S\"&COLUMN()-5)&\":Z\"&(ROW())&\"S\"&COLUMN()-5,0),G6)=1),\"X\",IF(AND(COUNTIF(INDIRECT(\"Z\"&(ROW()+1-$A6&\"S\"&COLUMN()-5)&\":Z\"&(ROW()+AnzSp-$A6)&\"S\"&COLUMN()-5,0),\">0\")=AnzSp,INDIRECT(\"Z\"&(ROW()+AnzSp+1-$A6)&\"S6\",0)>0,G6=LARGE(INDIRECT(\"Z\"&(ROW()+1-$A6&\"S\"&COLUMN()-5)&\":Z\"&(ROW()+AnzSp-$A6)&\"S\"&COLUMN()-5,0),1),COUNTIF(INDIRECT(\"Z\"&(ROW()+1-$A6&\"S\"&COLUMN()-5)&\":Z\"&(ROW())&\"S\"&COLUMN()-5,0),G6)<3),\"X\",IF(AND(COUNTIF(INDIRECT(\"Z\"&(ROW()+1-$A6&\"S\"&COLUMN()-5)&\":Z\"&(ROW()+AnzSp-$A6)&\"S\"&COLUMN()-5,0),\">0\")=AnzSp,INDIRECT(\"Z\"&(ROW()+AnzSp+1-$A6)&\"S6\",0)>0,G6=LARGE(INDIRECT(\"Z\"&(ROW()+1-$A6&\"S\"&COLUMN()-5)&\":Z\"&(ROW()+AnzSp-$A6)&\"S\"&COLUMN()-5,0),2),COUNTIF(INDIRECT(\"Z\"&(ROW()+1-$A6&\"S\"&COLUMN()-5)&\":Z\"&(ROW())&\"S\"&COLUMN()-5,0),G6)=1),\"X\",\"\"))),\"\")","v":""},"","","",{"$f":"SUM(G6:J6)","v":0}]
[2,"","",null,null,"",0,0,0,0,0,"","","","",{"$f":"SUM(G7:J7)","v":0}]
[3,"","",null,null,"",0,0,0,0,0,"","","","",0]
[4,"","",null,null,"",0,0,0,0,0,"","","","",0]
[5,"","",null,null,"",0,0,0,0,0,"","","","",0]
[null,{"$f":"IF(COUNT(INDIRECT(\"E\"&ROW()-AnzSp&\":E\"&ROW()-1))<=AnzSp-2,\"Kein Streicher\",IF(COUNT(INDIRECT(\"E\"&ROW()-AnzSp&\":E\"&ROW()-1))<=AnzSp-1,\"1 Streicher\",IF(AND(COUNT(INDIRECT(\"E\"&ROW()-AnzSp&\":E\"&ROW()-1))<=AnzSp,F11>0),\"2 Streicher\",\"Spieler Nr. \"&AnzSp&\" löschen und als Einzelspieler erfassen!\")))","v":"Kein Streicher"},null,null,null,{"$f":"COUNTIF(INDIRECT(\"F\"&(ROW()-AnzSp)&\":F\"&ROW()-1),\"Jw\")+COUNTIF(INDIRECT(\"F\"&ROW()-AnzSp&\":F\"&ROW()-1),\"Jm\")+COUNTIF(INDIRECT(\"F\"&ROW()-AnzSp&\":F\"&ROW()-1),\"Schw\")+COUNTIF(INDIRECT(\"F\"&ROW()-AnzSp&\":F\"&ROW()-1),\"Schm\")","v":0},{"$f":"IF(COUNTIF(INDIRECT(\"G\"&ROW()-AnzSp&\":G\"&ROW()-1),\">0\")=AnzSp-2,SUM(INDIRECT(\"G\"&ROW()-AnzSp&\":G\"&ROW()-1)),IF(COUNTIF(INDIRECT(\"G\"&ROW()-AnzSp&\":G\"&ROW()-1),\">0\")=AnzSp-1,SUM(INDIRECT(\"G\"&ROW()-AnzSp&\":G\"&ROW()-1))-LARGE(INDIRECT(\"G\"&ROW()-AnzSp&\":G\"&ROW()-1),1),IF(COUNTIF(INDIRECT(\"G\"&ROW()-AnzSp&\":G\"&ROW()-1),\">0\")=AnzSp,SUM(INDIRECT(\"G\"&ROW()-AnzSp&\":G\"&ROW()-1))-LARGE(INDIRECT(\"G\"&ROW()-AnzSp&\":G\"&ROW()-1),1)-LARGE(INDIRECT(\"G\"&ROW()-AnzSp&\":G\"&ROW()-1),2),0)))","v":0},{"$f":"IF(COUNTIF(INDIRECT(\"H\"&ROW()-AnzSp&\":H\"&ROW()-1),\">0\")=AnzSp-2,SUM(INDIRECT(\"H\"&ROW()-AnzSp&\":H\"&ROW()-1)),IF(COUNTIF(INDIRECT(\"H\"&ROW()-AnzSp&\":H\"&ROW()-1),\">0\")=AnzSp-1,SUM(INDIRECT(\"H\"&ROW()-AnzSp&\":H\"&ROW()-1))-LARGE(INDIRECT(\"H\"&ROW()-AnzSp&\":H\"&ROW()-1),1),IF(COUNTIF(INDIRECT(\"H\"&ROW()-AnzSp&\":H\"&ROW()-1),\">0\")=AnzSp,SUM(INDIRECT(\"H\"&ROW()-AnzSp&\":H\"&ROW()-1))-LARGE(INDIRECT(\"H\"&ROW()-AnzSp&\":H\"&ROW()-1),1)-LARGE(INDIRECT(\"H\"&ROW()-AnzSp&\":H\"&ROW()-1),2),0)))","v":0},{"$f":"IF(COUNTIF(INDIRECT(\"I\"&ROW()-AnzSp&\":I\"&ROW()-1),\">0\")=AnzSp-2,SUM(INDIRECT(\"I\"&ROW()-AnzSp&\":I\"&ROW()-1)),IF(COUNTIF(INDIRECT(\"I\"&ROW()-AnzSp&\":I\"&ROW()-1),\">0\")=AnzSp-1,SUM(INDIRECT(\"I\"&ROW()-AnzSp&\":I\"&ROW()-1))-LARGE(INDIRECT(\"I\"&ROW()-AnzSp&\":I\"&ROW()-1),1),IF(COUNTIF(INDIRECT(\"I\"&ROW()-AnzSp&\":I\"&ROW()-1),\">0\")=AnzSp,SUM(INDIRECT(\"I\"&ROW()-AnzSp&\":I\"&ROW()-1))-LARGE(INDIRECT(\"I\"&ROW()-AnzSp&\":I\"&ROW()-1),1)-LARGE(INDIRECT(\"I\"&ROW()-AnzSp&\":I\"&ROW()-1),2),0)))","v":0},{"$f":"IF(COUNTIF(INDIRECT(\"J\"&ROW()-AnzSp&\":J\"&ROW()-1),\">0\")=AnzSp-2,SUM(INDIRECT(\"J\"&ROW()-AnzSp&\":J\"&ROW()-1)),IF(COUNTIF(INDIRECT(\"J\"&ROW()-AnzSp&\":J\"&ROW()-1),\">0\")=AnzSp-1,SUM(INDIRECT(\"J\"&ROW()-AnzSp&\":J\"&ROW()-1))-LARGE(INDIRECT(\"J\"&ROW()-AnzSp&\":J\"&ROW()-1),1),IF(COUNTIF(INDIRECT(\"J\"&ROW()-AnzSp&\":J\"&ROW()-1),\">0\")=AnzSp,SUM(INDIRECT(\"J\"&ROW()-AnzSp&\":J\"&ROW()-1))-LARGE(INDIRECT(\"J\"&ROW()-AnzSp&\":J\"&ROW()-1),1)-LARGE(INDIRECT(\"J\"&ROW()-AnzSp&\":J\"&ROW()-1),2),0)))","v":0},{"$f":"SUM(G11:J11)","v":0}]

{"sheet":"Startliste","index":5,"n_rows":34,"n_cols":4,"rows_kept":34,"cut":false,"hidden":false,"merged":[[0,0,0,3],[11,0,11,3]]}
[{"$f":"Deckblatt!A3","v":"1. Spieltag  -  Bezirksklasse Nord  -  Saison 2019"}]
[]
[]
["Turnierleitung:",null,{"$f":"IF(Deckblatt!D6=0,\"\",Deckblatt!D6)","v":""},{"$f":"IF(Deckblatt!G6=0,\"\",Deckblatt!G6)","v":""}]
[]
["Oberschiedsrichter:",null,{"$f":"IF(Deckblatt!D8=0,\"\",Deckblatt!D8)","v":""},{"$f":"IF(Deckblatt!G8=0,\"\",Deckblatt!G8)","v":""}]
["Schiedsrichter:",null,{"$f":"IF(Deckblatt!D9=0,\"\",Deckblatt!D9)","v":""},{"$f":"IF(Deckblatt!G9=0,\"\",Deckblatt!G9)","v":""}]
["Schiedsrichter:",null,{"$f":"IF(Deckblatt!D10=0,\"\",Deckblatt!D10)","v":""},{"$f":"IF(Deckblatt!G10=0,\"\",Deckblatt!G10)","v":""}]
[]
[]
[]
["Startliste"]
[]
[1]
[2]
[3]
[4]
[5]
[6]
[7]
[8]
[9]
[10]
[11]
[12]
[13]
[14]
[15]
[16]
[17]
[18]
[19]
[20]
[21]

{"sheet":"Konstanten","index":6,"n_rows":37,"n_cols":7,"rows_kept":37,"cut":false,"hidden":true,"merged":[]}
[]
["Kurzbezeichnung","Reihenfolge",null,"Ligennummer","Ligenbezeichnung","Anzahl Spieler","Kategoriewertung"]
["D",1,null,1,"Bezirksklasse Nord",5,"Ja"]
["H",2,null,2,"Bezirksklasse Mitte",5,"Ja"]
["Sw 1",3,null,3,"Bezirksklasse Ost",5,"Ja"]
["Sm 1",4,null,4,"Bezirksklasse Süd",5,"Ja"]
["Sw 2",5,null,5,"Bezirksliga Nord-Mitte",5,"Ja"]
["Sm 2",6,null,6,"Landesliga Nord",6,"Nein"]
["Jw",7,null,7,"Landesliga Süd",6,"Nein"]
["Jm",8,null,8,"Verbandsliga Staffel 1",7,"Nein"]
["Schw",9,null,9,"Verbandsliga Staffel 2",7,"Nein"]
["Schm",10,null,10,"3. Bundesliga Nord Staffel 1",7,"Nein"]
[null,null,null,11,"3. Bundesliga Nord Staffel 2",7,"Nein"]
[null,null,null,12,"3. Bundesliga Nord Staffel 3",7,"Nein"]
[null,null,null,13,"2. Bundesliga Nord Staffel 1",8,"Nein"]
[null,null,null,14,"2. Bundesliga Nord Staffel 2",8,"Nein"]
[]
["1. Spieltag"]
["2. Spieltag"]
["3. Spieltag"]
["4. Spieltag"]
["5. Spieltag"]
[]
[]
[]
[]
["Aktuelle Auswahl Liga:",null,1]
["Aktuelle Auswahl Spieltag:",null,1]
["Aktuelle Anzahl der Runden",null,{"$f":"COUNT(Deckblatt!H23:K23)","v":0}]
["Anzahl der Spieler in Team",null,{"$f":"VLOOKUP(Ligawahl,Teamgröße,3,0)","v":5}]
[]
["Bahnensysteme",null,null,"blau","grün","rot"]
[null,"Miniaturgolf",1,19,24,29]
[null,"Beton",2,24,29,35]
[null,"Filzgolf",3,29,35,39]
[]
["Aktuelle Auswahl System:",null,{"$f":"VLOOKUP(Deckblatt!P9,Systemliste,2,0)","v":1},{"$f":"VLOOKUP(Deckblatt!P9,Systemliste,3,0)","v":19},{"$f":"VLOOKUP(Deckblatt!P9,Systemliste,4,0)","v":24},{"$f":"VLOOKUP(Deckblatt!P9,Systemliste,5,0)","v":29}]

{"sheet":"players","index":7,"n_rows":3979,"n_cols":11,"rows_kept":3979,"cut":false,"hidden":false,"merged":[]}
["SpielerNr","Kategorie","Vorname","Nachname","Kurzname","MVBN","LizenzNr","SC","SB","SA","TL"]
[25891,"Sm 2","Lothar","Abele","1. MGC Metzingen e.V.","","","","","",""]
[869,"Sw 2","Birgit","Abeling-Betzien","BGC Diepholz","Ja","","","","",""]
[33312,"Sm 2","Edgar","Abelmann","BGC Hannover","Ja","","","","",""]
[27712,"Sm 1","Thomas","Abendroth","Reinickendorfer MGC e.V.","","","","","",""]
[43272,"H","Hendrik","Ackermann","1. MGC Ludwigshafen e.V.","","","","","",""]
[34631,"H","Jan Sebastian","Adam","VfL Lüneburg","Ja","12733","X","","",""]
[67154,"D","Jessica","Adam","VfL Lüneburg","Ja","29732","X","","",""]
[36366,"Sm 2","Herbert","Adam","MGC Felderbachtal 1964 e.V.","","","","","",""]
[36901,"Sw 2","Gabriele","Adam","MGC Felderbachtal 1964 e.V.","","","","","",""]
[37193,"H","Tim","Adamczyk","SG Arheilgen Abt. Bahnengolf","","","","","",""]
[35408,"D","Jasmin","Adamczyk","MGC Bad Homburg vdH e.V.","","","","","",""]
[35377,"Sm 2","Michael","Adamczyk","MGC Bad Homburg vdH e.V.","","","","","",""]
[37108,"Sw 2","Astrid","Adamczyk","MGC Bad Homburg vdH e.V.","","","","","",""]
[35715,"Sm 2","Bernd","Adamski","MGC Rot-Weiß Wanne-Eickel e.V.","","","","","",""]
[46986,"Sm 1","Jürgen","Adenau","1.KGC Mönchengladbach e.V.","","","","","",""]
[29794,"H","Markus","Affeld","MSC Herscheid 1963 e.V.","","","","","",""]
[24649,"H","Alan","Ahmed","MGC Bad Oldesloe e.V.","","","","","",""]
[36151,"H","Pasi","Aho","BGC Neutraubling e.V.","","","","","",""]
[66361,"H","Marcel","Ahrens","MGC Peine","Ja","","","","",""]
[37046,"Sw 1","Mabel","Ahrentropp","HMC Büttgen e.V.","","","","","",""]
[66842,"Jw","Catharina","Aichele","MGC Monrepos e.V.","","","","","",""]
[27728,"H","Sascha","Albrecht","MGC Göttingen","Ja","","","","",""]
[66650,"D","Nassim","Alizadeh","Miniaturgolf Sportclub Schriesheim e.V","","","","","",""]
[67318,"Schm","Leon","Allmacher","MGC Traben-Trarbach","","","","","",""]
[67317,"Sm 1","Jürgen","Allmacher","MGC Traben-Trarbach","","","","","",""]
[33902,"D","Bianca","Allmüller","BGV Backumer Tal Herten e.V.","","","","","",""]
[33903,"Sm 1","Markus","Allmüller","BGV Backumer Tal Herten e.V.","","","","","",""]
[29237,"Sm 1","Peter","Amberger","BGC Neutraubling e.V.","","","","","",""]
[67242,"Sm 1","Tobias","Amely","MSC Bad Godesberg e.V.","","","","","",""]
[5720,"Sm 2","Wolfgang","Ament","SV 1890 e.V. Dreieichenhain, Abt. Bahnengolf","","","","","",""]
[50612,"H","Oliver","Anders","MGC Dortmund Syburg e.V.","","","","","",""]
[44990,"Sm 1","Alexander","Anders","BGSV Castrop e.V. 1961","","","","","",""]
[66492,"Sm 1","Uwe","Andrejewski","1. MGC Gelsenkirchen e.V.","","","","","",""]
[66109,"Sm 1","Andre","Andresen","BGC Kiel West e.V.","","","","","",""]
[37496,"Sm 2","Klaus-Dieter","Andresen","MGC Harrislee-Wassersleben","","","","","",""]
[66201,"Sm 2","Bernd","Andrzejak","MGC Rot-Weiß Wanne-Eickel e.V.","","","","","",""]
[67210,"Sm 2","Karl-Heinz","Angabreit","BGC Uerdingen e.V.","","","","","",""]
[66678,"H","Florian","Angermaier","MGC Bad Feilnbach e.V.","","","","","",""]
[4969,"Sm 2","Manfred","Anlauff","1. MC Weinheim e.V.","","","","","",""]
[67183,"Schm","Robin","Antholz","MSG Kempten e.V.","","","","","",""]
[66920,"D","Stephanie","Anton","1. BGC Rodalben 1977 e.V.","","","","","",""]
[66879,"Schm","Sean","Anton","1. BGC Rodalben 1977 e.V.","","","","","",""]
[27278,"Sm 1","Udo","Apelmeier","BV Sennestadt","","","","","",""]
[45054,"Sm 1","Willi","Appel","Miniaturgolf Sportclub Schriesheim e.V","","","","","",""]
[32949,"Sm 2","Dieter","Appelhans","BV Sennestadt","","","","","",""]
[29034,"H","André","Appelmann","VfM Bottrop e.V.","","","","","",""]
[36479,"D","Laura","Appelmann","VfM Bottrop e.V.","","","","","",""]
[47183,"H","Sascha","Arendt","BGSV Castrop e.V. 1961","","","","","",""]
[67250,"Sw 1","Angelina","Arendt","BGSV Castrop e.V. 1961","","","","","",""]
[27450,"Sm 1","Ingo","Arens","BSC Ennepetal e.V.","","","","","",""]
[26327,"H","Christoph","Arenz","MSC Bad Godesberg e.V.","","","","","",""]
[4769,"Sm 2","Heinz Josef","Arenz","MSC Bad Godesberg e.V.","","","","","",""]
[37811,"Sm 2","Helmut","Arlt","SV Gebhardshagen","Ja","","","","",""]
[60227,"Sm 2","Gerhard","Arndt","VfL Lohbrügge Abt. Bahnengolf","","","","","",""]
[35780,"H","Mark","Arnold","SG Arheilgen Abt. Bahnengolf","","","","","",""]
[60125,"Sm 2","Kurt","Arnold","MGC Murnau am Staffelsee e.V.","","","","","",""]
[35779,"Sm 2","Günter","Arnold","BGSV Aßlar 1987 e.V.","","","","","",""]
[18435,"Sm 2","Klaus","Arnold","HMC Büttgen e.V.","","","","","",""]
[35778,"Sw 2","Franziska","Arnold","BGSV Aßlar 1987 e.V.","","","","","",""]
{"$rows_left_out":3919}